Web Analytics Made Easy - Statcounter

Are in Unnamed Module of Loader App: What This Error Means and How to Fix It Os mac error

If you are searching about Columnar Backend: Caching the next row to display failed. This is an you've visit to the right web. We have 25 Images about Columnar Backend: Caching the next row to display failed. This is an like sailpoint.object.Identity is in unnamed module of loader 'app'; - ISC, How to fix Windows Script Host Loader.vbs error? and also sugarcrm - Module loader error: "Manifest file specifies an. Read more:

Columnar Backend: Caching The Next Row To Display Failed. This Is An

Columnar Backend: Caching the next row to display failed. This is an forum.knime.com

Sailpoint.object.Identity Is In Unnamed Module Of Loader 'app'; - ISC

sailpoint.object.Identity is in unnamed module of loader 'app'; - ISC developer.sailpoint.com

Java - Why This Error , Which My Compiler Does'nt Catch? - Stack Overflow

java - why this error , which my compiler does'nt catch? - Stack Overflow stackoverflow.com

compiler nt loader

Hi! I Am Getting This Error In My Code: Exception | Chegg.com

Hi! I am getting this error in my code: Exception | Chegg.com www.chegg.com

Java - Error: Main.class Found In Top-level Directory (unnamed Package

java - Error: Main.class found in top-level directory (unnamed package stackoverflow.com

java main error package unnamed directory allowed level found class top not module

Android - Gradle: Error Running 'Unnamed': No Task To Execute Is

android - gradle: Error running 'Unnamed': No task to execute is stackoverflow.com

unnamed task execute specified running error gradle android

Fix Operating System Loader Has No Signature Error On Windows

Fix Operating System Loader has no signature error on Windows www.thewindowsclub.com

operating loader problem

Fix "Execution Failed For Task :app:compileDebugJavaWithJavac" In

Fix "Execution Failed for task :app:compileDebugJavaWithJavac" in www.geeksforgeeks.org

failed execution task compiler geeksforgeeks programmerah

将 实体类 存到Redisson ,取出时提示 Java.lang.ClassCastException: Class Com.sun

将 实体类 存到Redisson ,取出时提示 java.lang.ClassCastException: class com.sun github.com

Java.Base Restricts Access To Java.Lang In Unnamed Module

Java.Base Restricts Access To Java.Lang In Unnamed Module dongtienvietnam.com

Java.util.LinkedHashMap Is In Module Java.base Of Loader ‘bootstrap

java.util.LinkedHashMap is in module java.base of loader ‘bootstrap www.programmersought.com

Sugarcrm - Module Loader Error: "Manifest File Specifies An

sugarcrm - Module loader error: "Manifest file specifies an stackoverflow.com

error module manifest loader specifies unrecognized package type file suitecrm sugarcrm

Reddit Is Fun App Users Experience 'Forbidden' Error - What It Means

Reddit Is Fun App Users Experience 'Forbidden' Error - What It Means www.caheadline.com

Java - Error Opening Debug In Preferences In Eclipse - Stack Overflow

java - Error opening Debug in Preferences in Eclipse - Stack Overflow stackoverflow.com

eclipse error preferences debug opening edit

LiveBook · Manning

liveBook · Manning livebook.manning.com

Understanding Java.Lang.Noclassdeffounderror: Could Not Initialize Class

Understanding Java.Lang.Noclassdeffounderror: Could Not Initialize Class dongtienvietnam.com

Exception In Thread 'main' Java Lang NoClassDefFoundError FileName

Exception in thread 'main' java lang NoClassDefFoundError FileName www.youtube.com

java lang main exception thread noclassdeffounderror error

How To Fix Windows Script Host Loader.vbs Error?

How to fix Windows Script Host Loader.vbs error? ugetfix.com

Java Tutorial On Java.lang.ClassCastException || Clarification On Class

Java Tutorial on java.lang.ClassCastException || Clarification on Class www.youtube.com

Classes Up-to-date Check: Internal Error (java.lang

Classes up-to-date check: Internal error (java.lang discuss.kotlinlang.org

Ajax - (java.lang.String Is In Module Java.base Of Loader 'bootstrap

ajax - (java.lang.String is in module java.base of loader 'bootstrap stackoverflow.com

Ошибка ClassCastException: Class Io.jmix.ui.model.impl

Ошибка ClassCastException: class io.jmix.ui.model.impl forum.jmix.ru

Fix HP Battery Alert Error Code 601 Disable By John.brown2547 - Issuu

Fix HP Battery Alert Error Code 601 Disable by john.brown2547 - Issuu issuu.com

Mac OS X Finder Error 36: What Does This Error Means And How To Fix It

Mac OS X Finder Error 36: What does this error means and how to fix it www.easypcmod.com

os mac error

Modulenotfounderror: No Module Named Src [SOLVED]

modulenotfounderror: no module named src [SOLVED] itsourcecode.com

将 实体类 存到redisson ,取出时提示 java.lang.classcastexception: class com.sun. Compiler nt loader. Sailpoint.object.identity is in unnamed module of loader 'app';